{"text_format":"1","workbook":"xlsx","n_sheets":9,"sheets":["Einleitung","Substitution","bauliche Veränderungen","Grenznutzen","finanzielle Auswirkungen","ökologische Auswirkungen","individuelle Daten","Grunddaten","Zwischenrechnungen"],"not_rendered":{"charts":0,"images":2,"macros":1,"external_links":0,"defined_names":7,"comments":0,"pivot_tables":0},"unopened":[],"bounds":{"document_bytes":16777216,"sheet_cells":100000,"rows_first":2000,"rows_last":500,"rows_between":2000,"halvings":0,"cell_chars":16384,"cell_head_chars":4096},"cells_cut":0,"cells_raw":0,"read":"whole","date_system":"1900"}

{"sheet":"Einleitung","index":0,"n_rows":17,"n_cols":1,"rows_kept":17,"cut":false,"hidden":false,"merged":[]}
[]
[]
["In Anlehnung an das Projekt „Nachhaltige Biomassenutzung in Biogasanlagen auf der Grundlage der Wirtschaftsdüngerpotenziale in Niedersachsen – Bauernhof Niedersachsen“ ist das nachfolgende Exceltool als eine Berechnungs- und Entscheidungshilfe für Biogasanlagenbetreiber erstellt worden."]
[]
["Zum Hintergrund:"]
[]
["Das Bundesland Niedersachsen weist nach Angaben des Nährstoffberichts 2012/2013 in Bezug auf Wirtschaftsdünger in den Veredelungsregionen einen Nährstoffüberhang von bis zu 54 kg P2O5/ha LF aus tierischen Ausscheidungen und Gärresten auf; es müssen daher jährlich ca. 33.000 t Phosphat (P2O5) aus diesen Regionen exportiert werden. Andererseits liegen in den Ackerbauregionen im südlichen und östlichen Niedersachsen Phosphatdefizite vor, die bislang mit mineralischen Düngemitteln ausgeglichen werden. Wenn diese zukünftig durch Nährstoffe aus diesen überschüssigen Wirtschaftsdüngern ersetzt werden sollen, wäre eine vorausgehende energetische Nutzung dieser Wirtschaftsdünger in Biogasanlagen der beschriebenen Ackerbauregionen sowohl unter ökonomischen als auch ökologischen Gesichtspunkten sinnvoll. Nach dieser energetischen Nutzung würden diese Nährstoffe anschließend als Gärreste auf den umliegenden landwirtschaftlichen Nutzflächen als wertvolles organisches Düngemittel ausgebracht werden."]
[]
["Das vorliegende Exceltool soll dazu dienen, Betreibern von Biogasanlagen, vornehmlich in den östlichen und südöstlichen Regionen Niedersachsens, welche erstmalig Wirtschaftsdünger als Substrat in ihren Biogasanlagen einsetzen würden, wirtschaftliche und ökologische Auswirkungen für den Betriebsablauf der bestehenden Anlagen aufzuzeigen. Zahlreiche zusätzliche Gesetze und Verordnungen aus den Bereichen Bau-, Veterinär- und Transportrecht sind beim Einsatz von Wirtschaftsdüngern in Biogasanlagen zu beachten und sind mit den entsprechenden Auswirkungen in die folgenden Berechnungselemente eingeflossen. Darüber hinaus müssen die baulichen, organisatorischen und prozesstechnischen Voraussetzungen geschaffen werden, um einen stapelbaren oder flüssigen Wirtschaftsdünger in den bereits vorhandenen Vergärungsprozess integrieren zu können. Die Umstellung einer Biogasanlage auf den Einsatz von entsprechenden Wirtschaftsdüngern hat somit weitreichende betriebswirtschaftliche und ökologische Auswirkungen, die in den folgenden einzelnen Reitern des Exceltools individuell nach Eingabe der biogasanlagenspezifischen Daten errechnet und abgelesen werden können."]
[]
{"$rows_left_out":8}
{"sheet":"Substitution","index":1,"n_rows":41,"n_cols":9,"rows_kept":41,"cut":false,"hidden":false,"merged":[[3,0,3,8],[1,0,1,8],[4,0,4,8],[17,0,17,8],[29,0,29,8],[28,0,28,8],[16,0,16,8]]}
[]
["Mit dieser Berechnungseinheit soll ermöglicht werden, die aktuellen Substrat- und Gärrestmengen zu erfassen und mögliche Substitutionen einiger dieser Teilmengen durch Wirtschaftsdünger aufzuzeigen. In einem zweiten Schritt wird analysiert, ob mit dem neuen Substratmix die nötigen Voraussetzungen erfüllt wären, um den Güllebonus für den neuen Substratmix erhalten zu können. Hinter den Berechnungen steht der Grundsatz, dass die zu produzierende Menge an Methan und somit auch die elektrische Leistung der Biogasanlage auch nach der Substitution einzelner Substrate gleich bleibt."]
[]
["Welche Energiepflanzen werden eingesetzt und welche Mengen (jährlich)?"]
["Diese erste Berechnungstabelle soll dazu dienen, die aktuellen Substrateinsatzmengen der Biogasanlage zu erfassen und die entsprechenden daraus resultierenden Gärreste zu berechnen. Ein Grunddatensatz an Substraten ist im Programm hinterlegt. Wenn weitere Substrate eingesetzt werden, wählen Sie bitte „Alternative 1“ und/oder „Alternative 2“. Im Reiter \"individuelle Daten\" müssen dazu die entsprechenden Daten eingetragen werden. Die Reihenfolge der von Ihnen gewählten Substrate wird im Folgenden auch die Substitutionsreihenfolge darstellen. Das bedeutet, das Substrat, welches Sie als Energiepflanze 1 wählen, wird auch als erstes gegen den später gewählten Wirtschaftsdünger ersetzt. Die zu ersetzende Menge richtet sich nach den Energie- bzw. Methangehalten der einzelnen Substrate."]
[]
[null,null,"Substrat","aktuelle Menge","aktuelle Gärrestmenge","Einsparung Substrat","neue Menge Substrat","Anteil am Gesamtsubstrat","neue Gärrestmenge"]
[null,"Energiepflanze 1. (t FM)","-",0,{"$f":"D8*HLOOKUP(C8,Grunddaten!$B$17:$H$26,10,FALSE)","v":0},{"$f":"D8-G8","v":0},{"$f":"Zwischenrechnungen!F6","v":0},{"$f":"IF($G$26=0,0,G8/$G$26)","v":0},{"$f":"G8*HLOOKUP(C8,Grunddaten!$B$17:$H$26,10,FALSE)","v":0}]
[null,"Energiepflanze 2. (t FM)","-",0,{"$f":"D9*HLOOKUP(C9,Grunddaten!$B$17:$H$26,10,FALSE)","v":0},{"$f":"D9-G9","v":0},{"$f":"Zwischenrechnungen!F7","v":0},{"$f":"IF($G$26=0,0,G9/$G$26)","v":0},{"$f":"G9*HLOOKUP(C9,Grunddaten!$B$17:$H$26,10,FALSE)","v":0}]
[null,"Energiepflanze 3. (t FM)","-",0,{"$f":"D10*HLOOKUP(C10,Grunddaten!$B$17:$H$26,10,FALSE)","v":0},0,{"$f":"Zwischenrechnungen!F8","v":0},0,{"$f":"G10*HLOOKUP(C10,Grunddaten!$B$17:$H$26,10,FALSE)","v":0}]
{"$rows_left_out":32}
{"sheet":"bauliche Veränderungen","index":2,"n_rows":80,"n_cols":7,"rows_kept":80,"cut":false,"hidden":false,"merged":[[1,0,1,10]]}
[]
["Mit diesem Berechnungstool soll die Möglichkeit gegeben werden, nötige Umbaumaßnahmen an einer bestehenden NawaRo-Biogasanlage in einzelnen Anlagenelementen aufzuzeigen und anschließend mit einer monetären Bewertung zu versehen. Die mit einer Substratumstellung verbundenen baulichen Veränderungen an der Anlage werden in den folgenden Rubriken eingeteilt und mit monetären und mengenmässigen Durchschnittswerten vorgegeben. Sie können diese Durchschnittswerte übernehmen oder für Ihre Anlage individuelle Werte angeben. Eine jede Berechnung ist mit einer kurzen Erläuterung hinterlegt, sodass Sie jeden Berechnungsschritt nachvollziehen können. Diese Beschreibung finden Sie in den jeweiligen Informationszeichen in dem jeweiligen Kasten. Die im Folgenden angegebenen Elemente und Zahlen sind an Ihre jeweiligen Biogasanlage anzupassen und müssen als Richtwerte verstanden werden. \n\nDie Berechnungen entsprechen den Berechnungen aus dem Bericht \"Nachhaltige Biomassenutzung in Biogasanlagen auf der Grundlage der Wirtschaftsdüngerpotenziale in Niedersachsen - Bauernhof Niedersachsen\". Genauere Informationen bezüglich der berücksichtigten finanziellen Auswirkungen befinden sich im Bericht  in dem Abschnitt \"Bauliche Maßnahmen an bestehenden Anlagen\" auf den Seiten 18-21. Ein ausführlicheres Beispiel zur Berechnung der Emissionsdifferenz findet sich auf den Seiten 33-35."]
[]
[null,"Gärrestlager"]
[null,null,null,"Gärreste pro Jahr (m³)",null,{"$f":"Substitution!E26","v":0}]
[null,null,null,"vorh. Gärsubstratlager (m³)",null,0]
[null,null,null,"Lagerungszeit Gärrest (Monate)",null,6,{"$f":"F7","v":6}]
[null,null,null,{"$f":"CONCATENATE(\"neues Gärsubstratlagervolumen für  mind. (\",F7,\") Monate (m³)\")","v":"neues Gärsubstratlagervolumen für  mind. (6) Monate (m³)"},null,{"$f":"Substitution!I26/(12/F7)","v":0}]
[null,null,null,"theoretisch zusätzl. benötigtes Gärsubstratlager  (m³)",null,{"$f":"IF(F8-F6>0,F8-F6,0)","v":0}]
[null,null,null,"Sicherheitszuschlag Gärrestlager (m³)",null,{"$f":"G10","v":0},{"$f":"F9*0.2","v":0}]
{"$rows_left_out":71}
{"sheet":"Grenznutzen","index":3,"n_rows":52,"n_cols":7,"rows_kept":52,"cut":false,"hidden":false,"merged":[[1,0,1,10]]}
[]
["Die Berechnung des Grenznutzen ermöglicht abzuschätzen, welcher Ertrag sich bei welcher Substitutionskombination Energieplanze/Wirtschaftsdünger ergibt. \nFür die Berechnung wird angenommen, dass eine Tonne Wirtschaftsdünger zusätzlich eingesetzt und eine entsprechende Menge einer Energiepflanze substituiert wird, \nsodass der Brennwert der BGA konstant bleibt. Berücksichtigt werden nur die direkten finanziellen Auswirkungen. \nFolgende finanzielle Auswirkungen der Substitution werden betrachtet: \n\n - Durch den Einsatz von Wirtschaftsdünger in der BGA entstehen zusätzliche Transportkosten. Die Einsparung an Transportkosten für die eingesparte Menge an Energiepflanzen \n   wird vernachlässigt.\n - Durch die Substitution werden weniger Energiepflanzen benötigt. Kosten für die eingesparte Menge an Energiepflanzen werden daher eingespart.\n - Durch den Einsatz von Wirtschaftsdünger in der BGA erhöht sich die Menge an Nährstoffen im Gärrest, sodass der Wert des Gärrestes steigt. Zur Bestimmung der Wertsteigerung\n   werden die zusätzlichen Nährstoffe mit den Nährstoffpreisen bestimmt. Dazu wird berücksichtigt, dass die Ausbringung von Gärrest aufwendiger ist als die Ausbringung von Mineraldünger.\n - Durch die Abnahme des Wirtschaftsdüngers von einem abgebenden Betrieb entstehen dem BGA-Betreiber abhängig von der Art des Wirtschaftsdüngers Kosten oder er kann Einnahmen erzielen.\n\nDie Berechnungen entsprechen den Berechnungen aus dem Bericht \"Nachhaltige Biomassenutzung in Biogasanlagen auf der Grundlage der Wirtschaftsdüngerpotenziale in Niedersachsen -\nBauernhof Niedersachsen\". Genauere Informationen bezüglich der berücksichtigten finanziellen Auswirkungen befinden sich im Bericht in dem Abschnitt \"Logistische Betrachtung\" \nauf den Seiten 21-25. Ein ausführlicheres Beispiel zur Berechnung der Emissionsdifferenz findet sich auf den Seiten 36-38."]
[]
[null,"Eingesetzter Wirtschaftsdünger",null,"-"]
[]
[null,"Ersetzte Energiepflanzen",null,"-"]
[null,{"$f":"CONCATENATE(\"eingesparte Menge an \",D6,\" (t)\")","v":"eingesparte Menge an - (t)"},null,{"$f":"IF(HLOOKUP(D6,Grunddaten!B17:F22,6,FALSE)=0,0,HLOOKUP(D4,Grunddaten!B1:E6,6,FALSE)/HLOOKUP(D6,Grunddaten!B17:F22,6,FALSE))","v":0}]
[]
[null,"Transportkosten"]
[null,null,null,"Transportmedium",null,"-"]
{"$rows_left_out":43}
{"sheet":"finanzielle Auswirkungen","index":4,"n_rows":70,"n_cols":7,"rows_kept":70,"cut":false,"hidden":false,"merged":[[1,0,1,10]]}
[]
["In diesem Excelreiter „finanzielle Auswirkungen“ kann berechnet werden, welche generellen gesamtfinanziellen Auswirkungen der Einsatz des Wirtschaftsdüngers haben kann. Die folgenden einzelnen Tabellen „Transportkosten“, „Einsparung Energiepflanzen“, „Wertsteigerung Gärrest“, „Abnahme Wirtschaftsdünger“, „Güllebonus“ und „Investitionskosten“ bilden ganz zum Ende die Berechnungen zum „finanziellen Gesamtvor- oder nachteil“. \n\nDie Transportkosten erfassen den monetären Wert, um den Wirtschaftsdünger auf die Biogasanlage zu bringen. \nDie Einsparungen Energiepflanzen drücken den finanziellen Vorteil aus, der dadurch entsteht, dass weniger Energiepflanzen benötigt werden. \nDer Wertsteigerung Gärrest spiegelt die finanziellen Auswirkungen der durch den zusätzlichen Einsatz von Wirtschaftsdünger erhaltenen Nährstoffe wider. \nUnter der Abnahme Wirtschaftsdünger werden monetäre Geldzahlungen erfasst, die die Biogasanlage evtl. von den abgebenden Betrieben des Wirtschaftsdüngers erhält. \nDer Güllebonus wird anhand der jährlichen elektrischen Leistung der Anlage berechnet und in die Gesamtrechnung mit aufgenommen, sofern die Voraussetzungen dafür erfüllt werden. \nDie Investitionskosten fließen entsprechend der ausgewählten Wirtschaftsdüngerarten aus dem Reiter „bauliche Veränderungen“ mit ein. \n\nEventuell entstehende monetäre Vor- oder Nachteile durch sich ändernden personellen Aufwand werden nicht berücksichtigt."]
[]
[null,"Transportkosten"]
[null,null,null,"Transportdistanz (km)",null,0]
[null,null,null,"Transportmedium für flüssige Wirtschaftsdünger",null,"-"]
[null,null,null,{"$f":"CONCATENATE(\"Transportmedium für 1.WD (\",Substitution!C21,\")\")","v":"Transportmedium für 1.WD (-)"},null,{"$f":"IF(Substitution!C21=\"-\",\"-\",IF(HLOOKUP(Substitution!C21,Grunddaten!$B$1:$G$13,13,FALSE)=\"flüssig\",$F$6,Grunddaten!$E$31))","v":"-"}]
[null,null,null,{"$f":"CONCATENATE(\"Transportmedium für 2.WD (\",Substitution!C22,\")\")","v":"Transportmedium für 2.WD (-)"},null,{"$f":"IF(Substitution!C22=\"-\",\"-\",IF(HLOOKUP(Substitution!C22,Grunddaten!$B$1:$G$13,13,FALSE)=\"flüssig\",$F$6,Grunddaten!$E$31))","v":"-"}]
[null,null,null,{"$f":"CONCATENATE(\"Transportmedium für 3.WD (\",Substitution!C23,\")\")","v":"Transportmedium für 3.WD (-)"},null,{"$f":"IF(Substitution!C23=\"-\",\"-\",IF(HLOOKUP(Substitution!C23,Grunddaten!$B$1:$G$13,13,FALSE)=\"flüssig\",$F$6,Grunddaten!$E$31))","v":"-"}]
[null,null,null,{"$f":"CONCATENATE(\"variable Kosten pro km und t (€) (\",F6,\")\")","v":"variable Kosten pro km und t (€) (-)"},null,{"$f":"G10","v":0},{"$f":"HLOOKUP(F6,Grunddaten!B31:E34,3,FALSE)","v":0}]
{"$rows_left_out":61}
{"sheet":"ökologische Auswirkungen","index":5,"n_rows":67,"n_cols":7,"rows_kept":67,"cut":false,"hidden":false,"merged":[[1,0,1,10]]}
[]
["Auf diesem Tabellenblatt werden die ökologischen Auswirkungen der Substitution von Energiepflanzen durch Wirtschaftsdünger berechnet. \nBetrachtet werden die Wirkungskategorien \"Klimawandel\" und \"Versauerung\". Emissionen bezüglich Klimawandel werden in CO2 äquivalent angegeben, Emissionen bezüglich Versauerung in SO2 \näquivalent. Für die Berechnung der Emissionsdifferenzen wird angenommen, dass der Wirtschaftsdünger des abgebenden Betriebes aktuell zusätzlich auf Ackerflächen des abgebenden Betriebes \nausgebracht wird, ohne eine Düngewirkung zu haben. \n\nBei den Emissionsänderungen werden folgende Punkte betrachtet:\n\n - Durch den erhöhten Transportaufwand entstehen zusätzliche Emissionen.\n - Durch den Einsatz des Wirtschaftsdüngers in der BGA erhöht sich die Nährstoffmenge des Gärrestes. Daher können Mineraldünger eingespart werden und somit auch die produktionsbedingte \n   Emissionen.\n - Durch den Einsatz des Wirtschaftsdüngers werden Energiepflanzen substituiert. Die Emissionen für den Anbau dieser Energiepflanzen können daher eingespart werden. Emissionen für den \n   Anbau anderer Pflanzen sind nicht der Produktion von Biogas anzurechnen. \n - Die Lagerzeit des Wirtschaftsdüngers verringert sich durch den Einsatz in der Biogasanlage. Die Lagerzeitverkürzung führt zu weiteren Emissionseinsparungen.\n - Durch die Substitution wird mehr Stickstoff in Form von Gärrest ausgebracht, aber es wird weniger Wirtschaftsdünger zusätzlich ausgebracht (ohne Düngewirkung) und weniger Mineraldünger. \n   Insgesamt ergibt sich damit eine Emissionseinsparung, da weniger Ammoniakemissionen entstehen.\n - Durch die Substitution entsteht mehr Gärrest, der wiederum Mineraldünger substituiert. Da die Ausbringung von Gärrest aber aufwendiger ist als die Ausbringung von Mineraldünger, \n   erhöht sich der Dieselverbrauch für die Ausbringung und es entstehen zusätzliche Emissionen.\n - Durch den Einsatz des Wirtschaftsdüngers in der BGA sind Umbauten nötig. Durch diese Umbauten entstehen zusätzliche Emissionen.\n\nDie Berechnungen entsprechen den Berechnungen aus dem Bericht \"Nachhaltige Biomassenutzung in Biogasanlagen auf der Grundlage der Wirtschaftsdüngerpotenziale in Niedersachsen -\nBauernhof Niedersachsen\". Genauere Informationen bezüglich der ökologischen Auswirkungen befinden sich im Bericht auf den Seiten 25-29. \nEin ausführlicheres Beispiel zur Berechnung der Emissionsdifferenz findet sich auf den Seiten 43-45."]
[]
[null,"Transport"]
[null,null,null,"Transportmittel für flüssige Wirtschaftsdünger",null,"-"]
[null,null,null,"Transportdistanz (km)",null,0]
[null,null,null,{"$f":"CONCATENATE(\"Transportmedium für 1.WD (\",Substitution!C21,\")\")","v":"Transportmedium für 1.WD (-)"},null,{"$f":"IF(Substitution!C21=\"-\",\"-\",IF(HLOOKUP(Substitution!C21,Grunddaten!B1:G13,13,FALSE)=\"flüssig\",F5,Grunddaten!E31))","v":"-"}]
[null,null,null,{"$f":"CONCATENATE(\"Transportmedium für 2.WD (\",Substitution!C22,\")\")","v":"Transportmedium für 2.WD (-)"},null,{"$f":"IF(Substitution!C22=\"-\",\"-\",IF(HLOOKUP(Substitution!C22,Grunddaten!B1:G13,13,FALSE)=\"flüssig\",F5,Grunddaten!E31))","v":"-"}]
[null,null,null,{"$f":"CONCATENATE(\"Transportmedium für 3.WD (\",Substitution!C23,\")\")","v":"Transportmedium für 3.WD (-)"},null,{"$f":"IF(Substitution!C23=\"-\",\"-\",IF(HLOOKUP(Substitution!C23,Grunddaten!B1:G13,13,FALSE)=\"flüssig\",F5,Grunddaten!E31))","v":"-"}]
[null,null,null,{"$f":"CONCATENATE(\"Distanz leere Zwischenfahrten (\",F5,\")\")","v":"Distanz leere Zwischenfahrten (-)"},null,{"$f":"G10","v":25},{"$f":"IF(F5=\"Gülleauflieger\",F6,25)","v":25}]
{"$rows_left_out":58}
{"sheet":"individuelle Daten","index":6,"n_rows":26,"n_cols":5,"rows_kept":26,"cut":false,"hidden":false,"merged":[]}
[]
[null,"Name Wirtschaftsdünger",null,"Alternative 1","Alternative 2"]
[]
[null,"Stickstoff (kg) in t FM",null,0,0]
[null,"Phosphat (kg) in t FM",null,0,0]
[null,"Kaliumoxid (kg) in t FM",null,0,0]
[null,"Methanertrag (ln) in t FM",null,0,0]
[null,"Preis pro t (€)",null,0,0]
[null,"CO2-Emissionen Lagerung pro t (kg)",null,0,0]
[null,"SO2-Emissionen Lagerung pro t (kg)",null,0,0]
{"$rows_left_out":17}
{"sheet":"Grunddaten","index":7,"n_rows":45,"n_cols":8,"rows_kept":45,"cut":false,"hidden":true,"merged":[]}
["Wirtschaftsdünger","-","flüssige Schweinegülle","Schweinegülle (Dekanter)","Geflügelmist",{"$f":"'individuelle Daten'!D2","v":"Alternative 1"},{"$f":"'individuelle Daten'!E2","v":"Alternative 2"}]
[null,null,null,null,null," "," "]
["Stickstoff (kg) in t FM",0,5,9.8000000000000007,21,{"$f":"'individuelle Daten'!D4","v":0},{"$f":"'individuelle Daten'!E4","v":0}]
["Phosphat (kg) in t FM",0,3.2,15.6,17,{"$f":"'individuelle Daten'!D5","v":0},{"$f":"'individuelle Daten'!E5","v":0}]
["Kaliumoxid (kg) in t FM",0,3.7,3.9,22,{"$f":"'individuelle Daten'!D6","v":0},{"$f":"'individuelle Daten'!E6","v":0}]
["Methanertrag (ln) in t FM",0,12,35,82,{"$f":"'individuelle Daten'!D7","v":0},{"$f":"'individuelle Daten'!E7","v":0}]
["Preis pro t (€)",0,12,0,-10,{"$f":"'individuelle Daten'!D8","v":0},{"$f":"'individuelle Daten'!E8","v":0}]
["CO2-Emissionen Lagerung pro t (kg)",0,53.41,53.41,56.51,{"$f":"'individuelle Daten'!D9","v":0},{"$f":"'individuelle Daten'!E9","v":0}]
["SO2-Emissionen Lagerung pro t (kg)",0,1.08,1.08,7.82,{"$f":"'individuelle Daten'!D10","v":0},{"$f":"'individuelle Daten'!E10","v":0}]
["CO2-Emissionen Ausbringung pro t (kg)",0,5.73,5.73,5.92,{"$f":"'individuelle Daten'!D11","v":0},{"$f":"'individuelle Daten'!E11","v":0}]
{"$rows_left_out":36}
{"sheet":"Zwischenrechnungen","index":8,"n_rows":48,"n_cols":18,"rows_kept":48,"cut":false,"hidden":true,"merged":[]}
[]
[]
[]
[null,null,"Substrat","Menge","Einsparung","Neue Substratmenge","Methan",null,null,null,"Stickstoff",null,null,"Phosphat",null,null,"Kaliumoxid"]
[null,null,null,null,null,null,"Methanmenge (alt)","Benötigt für Zwischenrechnung",null,null,"alt","neu",null,"alt","neu",null,"alt","neu"]
[null,"Energiepflanze 1.",{"$f":"Substitution!C8","v":"-"},{"$f":"Substitution!D8","v":0},{"$f":"D6-F6","v":0},{"$f":"IF(H6>=G6,0,D6-H6/HLOOKUP(C6,Grunddaten!$B$17:$H$26,6,FALSE))","v":0},{"$f":"HLOOKUP(C6,Grunddaten!$B$17:$H$26,6,FALSE)*D6","v":0},{"$f":"H21","v":0},null,null,{"$f":"D6*HLOOKUP(C6,Grunddaten!B17:H26,3,FALSE)","v":0},{"$f":"F6*HLOOKUP(C6,Grunddaten!$B$17:$H$26,3,FALSE)","v":0},null,{"$f":"D6*HLOOKUP(C6,Grunddaten!$B$17:$H$26,4,FALSE)","v":0},{"$f":"F6*HLOOKUP(C6,Grunddaten!$B$17:$H$26,4,FALSE)","v":0},null,{"$f":"D6*HLOOKUP(C6,Grunddaten!$B$17:$H$26,5,FALSE)","v":0},{"$f":"F6*HLOOKUP(C6,Grunddaten!$B$17:$H$26,5,FALSE)","v":0}]
[null,"Energiepflanze 2.",{"$f":"Substitution!C9","v":"-"},{"$f":"Substitution!D9","v":0},{"$f":"D7-F7","v":0},{"$f":"IF(H7>=G7,0,IF(H7<0,D7,D7-H7/HLOOKUP(C7,Grunddaten!$B$17:$H$26,6,FALSE)))","v":0},{"$f":"HLOOKUP(C7,Grunddaten!$B$17:$H$26,6,FALSE)*D7","v":0},{"$f":"H6-G6","v":0},null,null,{"$f":"D7*HLOOKUP(C7,Grunddaten!$B$17:$H$26,3,FALSE)","v":0},{"$f":"F7*HLOOKUP(C7,Grunddaten!$B$17:$H$26,3,FALSE)","v":0},null,{"$f":"D7*HLOOKUP(C7,Grunddaten!$B$17:$H$26,4,FALSE)","v":0},{"$f":"F7*HLOOKUP(C7,Grunddaten!$B$17:$H$26,4,FALSE)","v":0},null,{"$f":"D7*HLOOKUP(C7,Grunddaten!$B$17:$H$26,5,FALSE)","v":0},{"$f":"F7*HLOOKUP(C7,Grunddaten!$B$17:$H$26,5,FALSE)","v":0}]
[null,"Energiepflanze 3.",{"$f":"Substitution!C10","v":"-"},{"$f":"Substitution!D10","v":0},0,{"$f":"IF(H8>=G8,0,IF(H8<0,D8,D8-H8/HLOOKUP(C8,Grunddaten!$B$17:$H$26,6,FALSE)))","v":0},{"$f":"HLOOKUP(C8,Grunddaten!$B$17:$H$26,6,FALSE)*D8","v":0},{"$f":"H7-G7","v":0},null,null,{"$f":"D8*HLOOKUP(C8,Grunddaten!$B$17:$H$26,3,FALSE)","v":0},{"$f":"F8*HLOOKUP(C8,Grunddaten!$B$17:$H$26,3,FALSE)","v":0},null,{"$f":"D8*HLOOKUP(C8,Grunddaten!$B$17:$H$26,4,FALSE)","v":0},{"$f":"F8*HLOOKUP(C8,Grunddaten!$B$17:$H$26,4,FALSE)","v":0},null,{"$f":"D8*HLOOKUP(C8,Grunddaten!$B$17:$H$26,5,FALSE)","v":0},{"$f":"F8*HLOOKUP(C8,Grunddaten!$B$17:$H$26,5,FALSE)","v":0}]
[null,"Energiepflanze 4.",{"$f":"Substitution!C11","v":"-"},{"$f":"Substitution!D11","v":0},0,{"$f":"IF(H9>=G9,0,IF(H9<0,D9,D9-H9/HLOOKUP(C9,Grunddaten!$B$17:$H$26,6,FALSE)))","v":0},{"$f":"HLOOKUP(C9,Grunddaten!$B$17:$H$26,6,FALSE)*D9","v":0},{"$f":"H8-G8","v":0},null,null,{"$f":"D9*HLOOKUP(C9,Grunddaten!$B$17:$H$26,3,FALSE)","v":0},{"$f":"F9*HLOOKUP(C9,Grunddaten!$B$17:$H$26,3,FALSE)","v":0},null,{"$f":"D9*HLOOKUP(C9,Grunddaten!$B$17:$H$26,4,FALSE)","v":0},{"$f":"F9*HLOOKUP(C9,Grunddaten!$B$17:$H$26,4,FALSE)","v":0},null,{"$f":"D9*HLOOKUP(C9,Grunddaten!$B$17:$H$26,5,FALSE)","v":0},{"$f":"F9*HLOOKUP(C9,Grunddaten!$B$17:$H$26,5,FALSE)","v":0}]
[null,"Energiepflanze 5.",{"$f":"Substitution!C12","v":"-"},{"$f":"Substitution!D12","v":0},0,{"$f":"IF(H10>=G10,0,IF(H10<0,D10,D10-H10/HLOOKUP(C10,Grunddaten!$B$17:$H$26,6,FALSE)))","v":0},{"$f":"HLOOKUP(C10,Grunddaten!$B$17:$H$26,6,FALSE)*D10","v":0},{"$f":"H9-G9","v":0},null,null,{"$f":"D10*HLOOKUP(C10,Grunddaten!$B$17:$H$26,3,FALSE)","v":0},{"$f":"F10*HLOOKUP(C10,Grunddaten!$B$17:$H$26,3,FALSE)","v":0},null,{"$f":"D10*HLOOKUP(C10,Grunddaten!$B$17:$H$26,4,FALSE)","v":0},{"$f":"F10*HLOOKUP(C10,Grunddaten!$B$17:$H$26,4,FALSE)","v":0},null,{"$f":"D10*HLOOKUP(C10,Grunddaten!$B$17:$H$26,5,FALSE)","v":0},{"$f":"F10*HLOOKUP(C10,Grunddaten!$B$17:$H$26,5,FALSE)","v":0}]
{"$rows_left_out":38}